{"text_format":"1","workbook":"xlsx","n_sheets":4,"sheets":["Ajánlati tábla","Calc","Díjak-növények","Segéd"],"not_rendered":{"charts":0,"images":5,"macros":1,"external_links":0,"defined_names":7,"comments":0,"pivot_tables":0},"unopened":[],"bounds":{"document_bytes":16777216,"sheet_cells":100000,"rows_first":2000,"rows_last":500,"rows_between":2000,"halvings":0,"cell_chars":16384,"cell_head_chars":4096},"cells_cut":0,"cells_raw":0,"read":"whole","date_system":"1900"}

{"sheet":"Ajánlati tábla","index":0,"n_rows":34,"n_cols":26,"rows_kept":34,"cut":false,"hidden":false,"merged":[[23,17,24,17],[23,18,24,25],[10,10,10,12],[1,8,3,9],[10,7,10,9],[1,1,1,7],[2,2,2,5],[0,10,2,12],[20,2,20,4],[21,18,22,25],[19,17,20,17],[17,21,18,22],[21,17,22,17],[19,18,20,25],[15,1,15,6],[2,24,2,25],[17,23,18,25],[0,14,1,22],[0,2,0,9],[17,17,18,20],[18,1,18,4],[3,1,3,2],[2,16,2,18],[2,20,2,22],[3,10,3,22]]}
[null,null,"Biztosítási díjkalkulátor\n2021/2022. mezőgazdasági termelési időszakra\n(ver.: 2021.09.08)",null,null,null,null,null,null,null,"Államilag díjtámogatott \"A\" típusú összkockázatú biztosítás (+jég és vihar önrész biztosítás)\n(várható támogatás akár. 70%)*",null,null,null,"\"IKR Agrár mezőgazdasági biztosítási csomag\" vagy \n\"B illetve C\"  tipusú államilag díjtámogatott és GAZDA kiegészítő biztosítási csomag (GB444)\n(várható támogatás minimum 50 %)*"]
[null,"Biztosítási alapadatok",null,null,null,null,null,null,"Igényel állami támogatást?"]
[null,"Növény csoport választás: ==>","Alap_szántóföldi_növények",null,null,null,null,null,null,null,null,null,null,null,"Alap biztosítás\njég, tűz kockázatra",null,"Kiegészítő biztosítás\n vihar kockázatra",null,null,null,"Kiegészítő biztosítás\ntéli fagy kockázatra",null,null,null,"Kalkulált biztosítási díj összesen"]
[null,"Biztosítandó növények (kódok)",null,"Biztosítandó terület (ha)","Várható hozam (tonna/ha)","Termény biztosítandó egységára (tonna/HUF)","Kalkulált biztosítási\nérték (HUF)","Egy hektárra jutó biztosítási érték (HUF)",null,null,"Biztosítási díjak (állami támogatás nélkül)",null,null,null,null,null,null,null,null,null,null,null,null,null,"Állami támogatás nélkül","Várható állami támogatás után*\n"]
[null,"Nincs",{"$f":"Calc!A6","v":"===="},null,null,null,{"$f":"Calc!F6","v":0},{"$f":"Calc!G6","v":""},null,{"$f":"Calc!J6","v":"-----"},null,{"$f":"Calc!N6","v":"-----"},{"$f":"Calc!S6","v":0},null,{"$f":"Calc!V6","v":0},null,null,{"$f":"Calc!AF6","v":"-----"},{"$f":"Calc!AG6","v":0},null,null,{"$f":"Calc!AO6","v":"-----"},{"$f":"Calc!AP6","v":0},null,{"$f":"Calc!AV6","v":0},{"$f":"Calc!AW6","v":0}]
[null,"Nincs",{"$f":"Calc!A7","v":"===="},null,null,null,{"$f":"Calc!F7","v":0},{"$f":"Calc!G7","v":""},null,{"$f":"Calc!J7","v":"-----"},null,{"$f":"Calc!N7","v":"-----"},{"$f":"Calc!S7","v":0},null,{"$f":"Calc!V7","v":0},null,null,{"$f":"Calc!AF7","v":"-----"},{"$f":"Calc!AG7","v":0},null,null,{"$f":"Calc!AO7","v":"-----"},{"$f":"Calc!AP7","v":0},null,{"$f":"Calc!AV7","v":0},{"$f":"Calc!AW7","v":0}]
[null,"nincs",{"$f":"Calc!A8","v":"===="},null,null,null,{"$f":"Calc!F8","v":0},{"$f":"Calc!G8","v":""},null,{"$f":"Calc!J8","v":"-----"},null,{"$f":"Calc!N8","v":"-----"},{"$f":"Calc!S8","v":0},null,{"$f":"Calc!V8","v":0},null,null,{"$f":"Calc!AF8","v":"-----"},{"$f":"Calc!AG8","v":0},null,null,{"$f":"Calc!AO8","v":"-----"},{"$f":"Calc!AP8","v":0},null,{"$f":"Calc!AV8","v":0},{"$f":"Calc!AW8","v":0}]
[null,"nincs",{"$f":"Calc!A9","v":"===="},null,null,null,{"$f":"Calc!F9","v":0},{"$f":"Calc!G9","v":""},null,{"$f":"Calc!J9","v":"-----"},null,{"$f":"Calc!N9","v":"-----"},{"$f":"Calc!S9","v":0},null,{"$f":"Calc!V9","v":0},null,null,{"$f":"Calc!AF9","v":"-----"},{"$f":"Calc!AG9","v":0},null,null,{"$f":"Calc!AO9","v":"-----"},{"$f":"Calc!AP9","v":0},null,{"$f":"Calc!AV9","v":0},{"$f":"Calc!AW9","v":0}]
[null,"nincs",{"$f":"Calc!A10","v":"===="},null,null,null,{"$f":"Calc!F10","v":0},{"$f":"Calc!G10","v":""},null,{"$f":"Calc!J10","v":"-----"},null,{"$f":"Calc!N10","v":"-----"},{"$f":"Calc!S10","v":0},null,{"$f":"Calc!V10","v":0},null,null,{"$f":"Calc!AF10","v":"-----"},{"$f":"Calc!AG10","v":0},null,null,{"$f":"Calc!AO10","v":"-----"},{"$f":"Calc!AP10","v":0},null,{"$f":"Calc!AV10","v":0},{"$f":"Calc!AW10","v":0}]
[null,"Nincs",{"$f":"Calc!A11","v":"===="},null,null,null,{"$f":"Calc!F11","v":0},{"$f":"Calc!G11","v":""},null,{"$f":"Calc!J11","v":"-----"},null,{"$f":"Calc!N11","v":"-----"},{"$f":"Calc!S11","v":0},null,{"$f":"Calc!V11","v":0},null,null,{"$f":"Calc!AF11","v":"-----"},{"$f":"Calc!AG11","v":0},null,null,{"$f":"Calc!AO11","v":"-----"},{"$f":"Calc!AP11","v":0},null,{"$f":"Calc!AV11","v":0},{"$f":"Calc!AW11","v":0}]
[null,"Összesen",null,{"$f":"SUM(D5:D10)","v":0},null,null,{"$f":"Calc!F12","v":0},null,null,null,{"$f":"Calc!S12","v":0},null,null,null,{"$f":"Calc!V12","v":0},null,null,null,{"$f":"Calc!AG12","v":0},null,null,null,{"$f":"Calc!AP12","v":0},null,{"$f":"Calc!AV12","v":0},{"$f":"SUM(Z5:Z10)","v":0}]
[]
[null,"(alkalmazható 2021. szeptember 1-től 2022. május 31-ig)"]
[]
[]
[null,"Amennyiben sikerült felkelteni érdeklődését a kitöltött kalkulációt juttassa el az IKR Agrár Kft. területileg illetékes üzletkötőjéhez"]
[]
[null,"vagy",null,null,null,null,null,null,null,null,null,null,null,null,null,null,null,"Érdeklődő adatai:",null,null,null,"IKR Agrár partnerkód \n(ha már partnerünk)"]
[null,"Szollingerné Böröcz Renáta\nnövénybiztosítási ügyintéző részére"]
[null,null,null,null,null,null,null,null,null,null,null,null,null,null,null,null,null,"Név:"]
{"$rows_left_out":15}
{"sheet":"Calc","index":1,"n_rows":15,"n_cols":54,"rows_kept":15,"cut":false,"hidden":true,"merged":[[1,0,4,0],[1,1,4,1],[2,21,2,27],[3,21,3,22],[2,2,2,4],[2,5,4,5],[2,6,4,6],[0,8,1,9],[0,11,1,19],[2,8,3,9],[2,47,3,52],[2,11,3,13],[2,18,3,19],[2,14,3,17],[2,32,3,36],[0,29,1,36],[0,22,1,27],[0,38,1,45],[2,29,3,31],[2,38,3,40],[2,41,3,45]]}
[null,null,null,null,null,null,null,null,null,null,null,"Vezérlések \"A\" típusú biztosítás",null,null,null,null,null,null,null,null,null,null,"Alap fedezet (tűz, jég) kezelése",null,null,null,null,null,null,"Vihar kiegészítő kezelése",null,null,null,null,null,null,null,null,"Télifagy kiegészítő kezelése"]
["kód","növ. neve",null,null,null,null,null,null,null,null,null,null,null,null,null,null,null,null,null,null,null,"Kalkulált díjak"]
[null,null,"Átvett biztosítási alapadatok",null,null,{"$f":"'Ajánlati tábla'!G4","v":"Kalkulált biztosítási\nérték (HUF)"},{"$f":"'Ajánlati tábla'!H4","v":"Egy hektárra jutó biztosítási érték (HUF)"},null,null,null,null,"\"A\" összkockázatú biztosítást",null,null,"Díjtételek és díjak",null,null,null,"Biztosítási díj",null,null,"Alap fedezet (tűz, jég)",null,null,null,null,null,null,null,"Vihar kiegészítőt vezérlése",null,null,null,null,null,null,null,null,"télifagy kiegészítő vezérlése"]
[null,null,null,null,null,null,null,null,null,null,null,null,null,null,null,null,null,null,null,null,null,"Kalkulált díjak"]
[null,null,{"$f":"'Ajánlati tábla'!D4","v":"Biztosítandó terület (ha)"},{"$f":"'Ajánlati tábla'!E4","v":"Várható hozam (tonna/ha)"},{"$f":"'Ajánlati tábla'!F4","v":"Termény biztosítandó egységára (tonna/HUF)"},null,null,null,"Kér állami támogatást? (aj ajánlati lapról)","Állami támogatás szöveg",null,"\"A\" biztosítás kérhető?","Igényel \"A\" összkockázatú biztosítást","\"A\" összkockázatú díj szöveg","Támogatás nélkül díjtétel","Kiegészítő díjtétel","Támogatott díj támogatás nélkül összesen","Kiegészítő díj összesen","Támogatás nélkül összesen","Támogatás után",null,"Teljes díj","Támogatott díj","Kiegészítő díj","Támogatott kulcs (tűz)","Kiegészítő kulcs (tűz)","Támogatott kulcs (jég)","Kiegészítő kulcs (jég)",null,"Kérhető vihar?","Kér vihart (az ajaánlati lapról)","Vihar szöveg","Teljes díj","Támogatott díj","Kiegészítő díj","Támogatott kulcs","Kiegészítő kulcs",null,"Köthető télifagy","Kér télifagyot (az ajaánlati lapról)","Télifagy szöveg","Teljes díj","Támogatott díj","Kiegészítő díj","Támogatott kulcs","Kiegészítő kulcs",null,"Teljes díj (támogatás nélkül, alap + kiegészítő)","Támogatott díj összesen (az ajánlati táblára)","Támogatott díj összesen csak az \"A\" választása esetén","Támogatott díj összesen csak a \"B és C\" esetén","Támogatott díj (összesen)","Kiegészítő díj (összesen)","Ellenőrzés"]
[{"$f":"IFERROR(VLOOKUP(B6,'Díjak-növények'!B:AF,30,FALSE),\"====\")","v":"===="},{"$f":"'Ajánlati tábla'!B5","v":"Nincs"},{"$f":"'Ajánlati tábla'!D5","v":0},{"$f":"'Ajánlati tábla'!E5","v":0},{"$f":"'Ajánlati tábla'!F5","v":0},{"$f":"IF(A6=\"------\",0,C6*D6*E6)","v":0},{"$f":"IF((F6+C6=0),\"\",F6/C6)","v":""},null,true,{"$f":"IF(F6=0,\"-----\",IF(I6,\"Igen\",\"Nem\"))","v":"-----"},null,{"$f":"VLOOKUP(A6,'Díjak-növények'!A:E,3,0)","v":"Nem"},false,{"$f":"IF(E6=0,\"-----\",IF(L6=\"Nem\",\"Nincs\",IF(M6,\"Igen\",\"Nem\")))","v":"-----"},{"$f":"IF(N6=\"Igen\",VLOOKUP(A6,'Díjak-növények'!$A$5:$Z$312,22,0),0)","v":0},{"$f":"IF(N6=\"Igen\",VLOOKUP(A6,'Díjak-növények'!$A$5:$AA$312,26,0)-O6,0)","v":0},{"$f":"IFERROR(F6*O6/100,0)","v":0},{"$f":"IFERROR(F6*P6/100,0)","v":0},{"$f":"Q6+R6","v":0},{"$f":"IF(J6=\"-----\",0,IF(J6=\"Nem\",S6,Q6*$D$15+R6))","v":0},null,{"$f":"W6+X6","v":0},{"$f":"F6*(Y6+AA6)/100","v":0},{"$f":"F6*(Z6+AB6)/100","v":0},0,{"$f":"IF($N6=\"Igen\",0,VLOOKUP($A6,'Díjak-növények'!$A:$Z,12,0))","v":0},{"$f":"IF($N6=\"Igen\",0,VLOOKUP($A6,'Díjak-növények'!$A:$Z,13,0))","v":0},{"$f":"IF($N6=\"Igen\",0,VLOOKUP($A6,'Díjak-növények'!$A:$Z,14,0))","v":0},null,{"$f":"VLOOKUP($A6,'Díjak-növények'!$A:$Z,5,0)","v":"Nem"},false,{"$f":"IF(F6=0,\"-----\",IF(OR(AD6=\"Nem\",N6=\"Igen\"),\"Nincs\",IF(AE6,\"Igen\",\"Nem\")))","v":"-----"},{"$f":"AH6+AI6","v":0},{"$f":"IF(AF6=\"Igen\",F6*AJ6/100,0)","v":0},{"$f":"IF(AF6=\"Igen\",F6*AK6/100,0)","v":0},{"$f":"IF($AF6=\"Igen\",VLOOKUP($A6,'Díjak-növények'!$A:$Z,18,0),0)","v":0},{"$f":"IF($AF6=\"Igen\",VLOOKUP($A6,'Díjak-növények'!$A:$Z,19,0),0)","v":0},null,{"$f":"VLOOKUP($A6,'Díjak-növények'!$A:$Z,4,0)","v":"Nem"},false,{"$f":"IF(F6=0,\"-----\",IF(OR(AM6=\"Nem\",N6=\"Igen\"),\"Nincs\",IF(AN6,\"Igen\",\"Nem\")))","v":"-----"},{"$f":"AQ6+AR6","v":0},{"$f":"IF(AO6=\"Igen\",F6*AS6/100,0)","v":0},{"$f":"IF(AO6=\"Igen\",F6*AT6/100,0)","v":0},{"$f":"IF($AO6=\"Igen\",VLOOKUP($A6,'Díjak-növények'!$A:$Z,17,0),0)","v":0},0,null,{"$f":"S6+V6+AG6+AP6","v":0},{"$f":"IF(J6=\"Igen\",AX6+AY6+BA6,AV6)","v":0},{"$f":"IF(N6=\"Igen\",AZ6*(1-$D$15),0)","v":0},{"$f":"IF(J6=\"Igen\",(W6+AH6+AQ6)*(1-$D$14),0)","v":0},{"$f":"Q6+W6+AH6+AQ6","v":0},{"$f":"R6+X6+AI6+AR6","v":0},{"$f":"IF(AV6=(AZ6+BA6),\"OK\",\"Hiba\")","v":"OK"}]
[{"$f":"IFERROR(VLOOKUP(B7,'Díjak-növények'!B:AF,30,FALSE),\"====\")","v":"===="},{"$f":"'Ajánlati tábla'!B6","v":"Nincs"},{"$f":"'Ajánlati tábla'!D6","v":0},{"$f":"'Ajánlati tábla'!E6","v":0},{"$f":"'Ajánlati tábla'!F6","v":0},{"$f":"IF(A7=\"------\",0,C7*D7*E7)","v":0},"",null,true,{"$f":"IF(F7=0,\"-----\",IF(I7,\"Igen\",\"Nem\"))","v":"-----"},null,{"$f":"VLOOKUP(A7,'Díjak-növények'!A:E,3,0)","v":"Nem"},false,{"$f":"IF(E7=0,\"-----\",IF(L7=\"Nem\",\"Nincs\",IF(M7,\"Igen\",\"Nem\")))","v":"-----"},{"$f":"IF(N7=\"Igen\",VLOOKUP(A7,'Díjak-növények'!$A$5:$Z$312,22,0),0)","v":0},{"$f":"IF(N7=\"Igen\",VLOOKUP(A7,'Díjak-növények'!$A$5:$AA$312,26,0)-O7,0)","v":0},{"$f":"IFERROR(F7*O7/100,0)","v":0},{"$f":"IFERROR(F7*P7/100,0)","v":0},{"$f":"Q7+R7","v":0},{"$f":"IF(J7=\"-----\",0,IF(J7=\"Nem\",S7,Q7*$D$15+R7))","v":0},null,{"$f":"W7+X7","v":0},{"$f":"F7*(Y7+AA7)/100","v":0},{"$f":"F7*(Z7+AB7)/100","v":0},0,{"$f":"IF($N7=\"Igen\",0,VLOOKUP($A7,'Díjak-növények'!$A:$Z,12,0))","v":0},{"$f":"IF($N7=\"Igen\",0,VLOOKUP($A7,'Díjak-növények'!$A:$Z,13,0))","v":0},{"$f":"IF($N7=\"Igen\",0,VLOOKUP($A7,'Díjak-növények'!$A:$Z,14,0))","v":0},null,{"$f":"VLOOKUP($A7,'Díjak-növények'!$A:$Z,5,0)","v":"Nem"},false,{"$f":"IF(F7=0,\"-----\",IF(OR(AD7=\"Nem\",N7=\"Igen\"),\"Nincs\",IF(AE7,\"Igen\",\"Nem\")))","v":"-----"},{"$f":"AH7+AI7","v":0},{"$f":"IF(AF7=\"Igen\",F7*AJ7/100,0)","v":0},{"$f":"IF(AF7=\"Igen\",F7*AK7/100,0)","v":0},{"$f":"IF($AF7=\"Igen\",VLOOKUP($A7,'Díjak-növények'!$A:$Z,18,0),0)","v":0},{"$f":"IF($N7=\"Nem\",VLOOKUP($A7,'Díjak-növények'!$A:$Z,19,0),0)","v":0},null,{"$f":"VLOOKUP($A7,'Díjak-növények'!$A:$Z,4,0)","v":"Nem"},false,{"$f":"IF(F7=0,\"-----\",IF(OR(AM7=\"Nem\",N7=\"Igen\"),\"Nincs\",IF(AN7,\"Igen\",\"Nem\")))","v":"-----"},{"$f":"AQ7+AR7","v":0},{"$f":"IF(AO7=\"Igen\",F7*AS7/100,0)","v":0},{"$f":"IF(AO7=\"Igen\",F7*AT7/100,0)","v":0},{"$f":"IF($AO7=\"Nem\",0,VLOOKUP($A7,'Díjak-növények'!$A:$Z,17,0))","v":0},0,null,{"$f":"S7+V7+AG7+AP7","v":0},{"$f":"IF(J7=\"Igen\",AX7+AY7+BA7,AV7)","v":0},{"$f":"IF(N7=\"Igen\",AZ7*(1-$D$15),0)","v":0},{"$f":"IF(J7=\"Igen\",(W7+AH7+AQ7)*(1-$D$14),0)","v":0},{"$f":"Q7+W7+AH7+AQ7","v":0},{"$f":"R7+X7+AI7+AR7","v":0},{"$f":"IF(AV7=(AZ7+BA7),\"OK\",\"Hiba\")","v":"OK"}]
[{"$f":"IFERROR(VLOOKUP(B8,'Díjak-növények'!B:AF,30,FALSE),\"====\")","v":"===="},{"$f":"'Ajánlati tábla'!B7","v":"nincs"},{"$f":"'Ajánlati tábla'!D7","v":0},{"$f":"'Ajánlati tábla'!E7","v":0},{"$f":"'Ajánlati tábla'!F7","v":0},0,"",null,true,"-----",null,{"$f":"VLOOKUP(A8,'Díjak-növények'!A:E,3,0)","v":"Nem"},false,"-----",{"$f":"IF(N8=\"Igen\",VLOOKUP(A8,'Díjak-növények'!$A$5:$Z$312,22,0),0)","v":0},{"$f":"IF(N8=\"Igen\",VLOOKUP(A8,'Díjak-növények'!$A$5:$AA$312,26,0)-O8,0)","v":0},0,0,0,0,null,0,0,0,0,{"$f":"IF($N8=\"Igen\",0,VLOOKUP($A8,'Díjak-növények'!$A:$Z,12,0))","v":0},{"$f":"IF($N8=\"Igen\",0,VLOOKUP($A8,'Díjak-növények'!$A:$Z,13,0))","v":0},{"$f":"IF($N8=\"Igen\",0,VLOOKUP($A8,'Díjak-növények'!$A:$Z,14,0))","v":0},null,{"$f":"VLOOKUP($A8,'Díjak-növények'!$A:$Z,5,0)","v":"Nem"},false,"-----",0,0,0,{"$f":"IF($AF8=\"Igen\",VLOOKUP($A8,'Díjak-növények'!$A:$Z,18,0),0)","v":0},{"$f":"IF($N8=\"Nem\",VLOOKUP($A8,'Díjak-növények'!$A:$Z,19,0),0)","v":0},null,{"$f":"VLOOKUP($A8,'Díjak-növények'!$A:$Z,4,0)","v":"Nem"},false,"-----",0,0,0,{"$f":"IF($AO8=\"Nem\",0,VLOOKUP($A8,'Díjak-növények'!$A:$Z,17,0))","v":0},0,null,0,0,0,0,0,0,"OK"]
[{"$f":"IFERROR(VLOOKUP(B9,'Díjak-növények'!B:AF,30,FALSE),\"====\")","v":"===="},{"$f":"'Ajánlati tábla'!B8","v":"nincs"},{"$f":"'Ajánlati tábla'!D8","v":0},{"$f":"'Ajánlati tábla'!E8","v":0},{"$f":"'Ajánlati tábla'!F8","v":0},0,"",null,true,"-----",null,{"$f":"VLOOKUP(A9,'Díjak-növények'!A:E,3,0)","v":"Nem"},false,"-----",{"$f":"IF(N9=\"Igen\",VLOOKUP(A9,'Díjak-növények'!$A$5:$Z$312,22,0),0)","v":0},{"$f":"IF(N9=\"Igen\",VLOOKUP(A9,'Díjak-növények'!$A$5:$AA$312,26,0)-O9,0)","v":0},0,0,0,0,null,0,0,0,0,{"$f":"IF($N9=\"Igen\",0,VLOOKUP($A9,'Díjak-növények'!$A:$Z,12,0))","v":0},{"$f":"IF($N9=\"Igen\",0,VLOOKUP($A9,'Díjak-növények'!$A:$Z,13,0))","v":0},{"$f":"IF($N9=\"Igen\",0,VLOOKUP($A9,'Díjak-növények'!$A:$Z,14,0))","v":0},null,{"$f":"VLOOKUP($A9,'Díjak-növények'!$A:$Z,5,0)","v":"Nem"},false,"-----",0,0,0,{"$f":"IF($AF9=\"Igen\",VLOOKUP($A9,'Díjak-növények'!$A:$Z,18,0),0)","v":0},{"$f":"IF($N9=\"Nem\",VLOOKUP($A9,'Díjak-növények'!$A:$Z,19,0),0)","v":0},null,{"$f":"VLOOKUP($A9,'Díjak-növények'!$A:$Z,4,0)","v":"Nem"},false,"-----",0,0,0,{"$f":"IF($AO9=\"Nem\",0,VLOOKUP($A9,'Díjak-növények'!$A:$Z,17,0))","v":0},0,null,0,0,0,0,0,0,"OK"]
[{"$f":"IFERROR(VLOOKUP(B10,'Díjak-növények'!B:AF,30,FALSE),\"====\")","v":"===="},{"$f":"'Ajánlati tábla'!B9","v":"nincs"},{"$f":"'Ajánlati tábla'!D9","v":0},{"$f":"'Ajánlati tábla'!E9","v":0},{"$f":"'Ajánlati tábla'!F9","v":0},0,"",null,true,"-----",null,{"$f":"VLOOKUP(A10,'Díjak-növények'!A:E,3,0)","v":"Nem"},false,"-----",{"$f":"IF(N10=\"Igen\",VLOOKUP(A10,'Díjak-növények'!$A$5:$Z$312,22,0),0)","v":0},{"$f":"IF(N10=\"Igen\",VLOOKUP(A10,'Díjak-növények'!$A$5:$AA$312,26,0)-O10,0)","v":0},0,0,0,0,null,0,0,0,0,{"$f":"IF($N10=\"Igen\",0,VLOOKUP($A10,'Díjak-növények'!$A:$Z,12,0))","v":0},{"$f":"IF($N10=\"Igen\",0,VLOOKUP($A10,'Díjak-növények'!$A:$Z,13,0))","v":0},{"$f":"IF($N10=\"Igen\",0,VLOOKUP($A10,'Díjak-növények'!$A:$Z,14,0))","v":0},null,{"$f":"VLOOKUP($A10,'Díjak-növények'!$A:$Z,5,0)","v":"Nem"},false,"-----",0,0,0,{"$f":"IF($AF10=\"Igen\",VLOOKUP($A10,'Díjak-növények'!$A:$Z,18,0),0)","v":0},{"$f":"IF($N10=\"Nem\",VLOOKUP($A10,'Díjak-növények'!$A:$Z,19,0),0)","v":0},null,{"$f":"VLOOKUP($A10,'Díjak-növények'!$A:$Z,4,0)","v":"Nem"},false,"-----",0,0,0,{"$f":"IF($AO10=\"Nem\",0,VLOOKUP($A10,'Díjak-növények'!$A:$Z,17,0))","v":0},0,null,0,0,0,0,0,0,"OK"]
[{"$f":"IFERROR(VLOOKUP(B11,'Díjak-növények'!B:AF,30,FALSE),\"====\")","v":"===="},{"$f":"'Ajánlati tábla'!B10","v":"Nincs"},{"$f":"'Ajánlati tábla'!D10","v":0},{"$f":"'Ajánlati tábla'!E10","v":0},{"$f":"'Ajánlati tábla'!F10","v":0},0,"",null,true,"-----",null,{"$f":"VLOOKUP(A11,'Díjak-növények'!A:E,3,0)","v":"Nem"},false,"-----",{"$f":"IF(N11=\"Igen\",VLOOKUP(A11,'Díjak-növények'!$A$5:$Z$312,22,0),0)","v":0},{"$f":"IF(N11=\"Igen\",VLOOKUP(A11,'Díjak-növények'!$A$5:$AA$312,26,0)-O11,0)","v":0},0,0,0,0,null,0,0,0,0,{"$f":"IF($N11=\"Igen\",0,VLOOKUP($A11,'Díjak-növények'!$A:$Z,12,0))","v":0},{"$f":"IF($N11=\"Igen\",0,VLOOKUP($A11,'Díjak-növények'!$A:$Z,13,0))","v":0},{"$f":"IF($N11=\"Igen\",0,VLOOKUP($A11,'Díjak-növények'!$A:$Z,14,0))","v":0},null,{"$f":"VLOOKUP($A11,'Díjak-növények'!$A:$Z,5,0)","v":"Nem"},false,"-----",0,0,0,{"$f":"IF($AF11=\"Igen\",VLOOKUP($A11,'Díjak-növények'!$A:$Z,18,0),0)","v":0},{"$f":"IF($N11=\"Nem\",VLOOKUP($A11,'Díjak-növények'!$A:$Z,19,0),0)","v":0},null,{"$f":"VLOOKUP($A11,'Díjak-növények'!$A:$Z,4,0)","v":"Nem"},false,"-----",0,0,0,{"$f":"IF($AO11=\"Nem\",0,VLOOKUP($A11,'Díjak-növények'!$A:$Z,17,0))","v":0},0,null,0,0,0,0,0,0,"OK"]
[null,"Összesen",{"$f":"SUM(C6:C11)","v":0},null,null,{"$f":"SUM(F6:F11)","v":0},null,null,null,null,null,null,null,null,{"$f":"SUM(O6:O11)","v":0},{"$f":"SUM(P6:P11)","v":0},null,null,{"$f":"SUM(S6:S11)","v":0},null,null,{"$f":"SUM(V6:V11)","v":0},{"$f":"SUM(W6:W11)","v":0},{"$f":"SUM(X6:X11)","v":0},null,null,null,null,null,null,null,null,{"$f":"SUM(AG6:AG11)","v":0},0,0,null,null,null,null,null,null,{"$f":"SUM(AP6:AP11)","v":0},{"$f":"SUM(AQ6:AQ11)","v":0},{"$f":"SUM(AR6:AR11)","v":0},null,null,null,{"$f":"SUM(AV6:AV11)","v":0},{"$f":"SUM(AW6:AW11)","v":0},{"$f":"SUM(AX6:AX11)","v":0},null,{"$f":"SUM(AZ6:AZ11)","v":0},{"$f":"SUM(BA6:BA11)","v":0}]
[]
[null,"Várható állami támogatás mértéke (\"B, C\")",null,0.5]
[null,"Várható állami támogatás mértéke (\"A\")",null,0.7]

{"sheet":"Díjak-növények","index":2,"n_rows":312,"n_cols":32,"rows_kept":312,"cut":false,"hidden":true,"merged":[[0,0,3,0],[0,1,3,1],[0,5,0,9],[0,11,0,19],[0,21,0,25],[1,5,1,7],[1,8,1,9],[1,11,1,14],[1,16,3,16],[1,17,1,19],[1,25,3,25],[2,5,3,5],[2,6,3,6],[2,7,3,7],[2,8,3,8],[2,9,3,9],[0,2,1,4],[2,21,3,21],[2,2,3,2],[2,3,3,3],[2,4,3,4],[2,14,3,14],[2,17,3,17],[2,18,3,18],[2,19,3,19],[2,11,3,11],[2,12,3,12],[2,13,3,13],[1,22,1,23],[1,30,3,30],[1,31,3,31],[1,29,3,29],[0,27,0,29],[1,27,3,27],[1,28,3,28],[2,22,3,22],[2,23,3,23],[2,24,3,24]]}
["kód","növ. neve","Belső vezérlések",null,null,"Nem támogatott (GB444)",null,null,null,null,null,"Támogatott konstrukció \"B\" vagy \"C\" + GB444",null,null,null,null,null,null,null,null,null,"kilenc kockázat összevonva",null,null,null,null,null,"Belső vezérlések"]
[null,null,null,null,null,"alapkockázat",null,null,"kiegészítő",null,null,"alapkockázat",null,null,null,null,"kiegészítő télifagy \"B\" vagy \"C\"","kiegészítő vihar",null,null,null,"Támogatott  \"A\" típus","önrészbiztosítás (GB444)",null,null,"összesen",null,"IKR Agrár csoport","IKR Csoport megnevezés","MVH csoport megnevezés","hasznosítási kód","Növény veve"]
[null,null,"Köthető \"A típusú\" biztosítás","Köthető télifagy kiegészítő","Köthető vihar kiegészítő","tűz","jég","összesen","télifagy","vihar",null,"tűz (GB444)","jég (\"B\" vagy \"C\")","kiegészítő jég (GB444)","összesen",null,null,"Vihar \"B\" vagy \"C\"","önrészbiztosítás vihar GB444","összesen",null,"összkockázat","jég","vihar","Speciális tűz"]
[]
["====",null,"Nem",{"$f":"IF(I5<>0,\"Igen\",\"Nem\")","v":"Nem"},{"$f":"IF(J5<>0,\"Igen\",\"Nem\")","v":"Nem"},0,0,0,0,0,null,0,0,0,0,null,0,0,0,0,null,0,0,0,null,0,null,0,"Nincs","Nics",{"$f":"A5","v":"===="},{"$f":"B5","v":0}]
["KAL02","Tavaszi búza","Igen",{"$f":"IF(I6<>0,\"Igen\",\"Nem\")","v":"Nem"},{"$f":"IF(J6<>0,\"Igen\",\"Nem\")","v":"Igen"},0.06,0.63,{"$f":"F6+G6","v":0.69},null,0.5,null,0.06,0.53,0.1,{"$f":"L6+M6+N6","v":0.69000000000000006},null,null,0.4,0.1,{"$f":"S6+R6","v":0.5},null,1.5,0.1,0.1,0.06,{"$f":"X6+W6+V6+Y6","v":1.76},null,1,"Alap szántóföldi növények","Búza ",{"$f":"A6","v":"KAL02"},{"$f":"B6","v":"Tavaszi búza"}]
["KAL05","Tavaszi durumbúza","Igen","Nem","Igen",0.06,0.63,0.69,null,0.5,null,0.06,0.53,0.1,{"$f":"L7+M7+N7","v":0.69000000000000006},null,null,0.4,0.1,0.5,null,1.5,0.1,0.1,0.06,{"$f":"X7+W7+V7+Y7","v":1.76},null,1,"Alap szántóföldi növények","Búza ","KAL05","Tavaszi durumbúza"]
["KAL07","Tavaszi tönköly búza","Igen","Nem","Igen",0.06,0.63,0.69,null,0.5,null,0.06,0.53,0.1,0.69000000000000006,null,null,0.4,0.1,0.5,null,1.5,0.1,0.1,0.06,1.76,null,1,"Alap szántóföldi növények","Búza ","KAL07","Tavaszi tönköly búza"]
["KAL09","Tavaszi novum búza","Igen","Nem","Igen",0.06,0.63,0.69,null,0.5,null,0.06,0.53,0.1,0.69000000000000006,null,null,0.4,0.1,0.5,null,1.5,0.1,0.1,0.06,1.76,null,1,"Alap szántóföldi növények","Búza ","KAL09","Tavaszi novum búza"]
["KAL11","Tavaszi tönke búza","Igen","Nem","Igen",0.06,0.63,0.69,null,0.5,null,0.06,0.53,0.1,0.69000000000000006,null,null,0.4,0.1,0.5,null,1.5,0.1,0.1,0.06,1.76,null,1,"Alap szántóföldi növények","Búza ","KAL11","Tavaszi tönke búza"]
["KAL13","Tavaszi alakor búza","Igen","Nem","Igen",0.06,0.63,0.69,null,0.5,null,0.06,0.53,0.1,0.69000000000000006,null,null,0.4,0.1,0.5,null,1.5,0.1,0.1,0.06,1.76,null,1,"Alap szántóföldi növények","Búza ","KAL13","Tavaszi alakor búza"]
["KAL18","Tavaszi árpa","Igen","Nem","Igen",0.06,0.63,0.69,null,0.5,null,0.06,0.53,0.1,0.69000000000000006,null,null,0.4,0.1,0.5,null,1.5,0.1,0.1,0.06,1.76,null,1,"Alap szántóföldi növények","Árpa","KAL18","Tavaszi árpa"]
["KAL26","Tavaszi tritikálé","Igen","Nem","Igen",0.06,0.63,0.69,null,0.5,null,0.06,0.53,0.1,0.69000000000000006,null,null,0.4,0.1,0.5,null,1.5,0.1,0.1,0.06,1.76,null,1,"Alap szántóföldi növények","Tritikále","KAL26","Tavaszi tritikálé"]
["KAL01","Őszi búza","Igen","Igen","Igen",0.06,0.63,0.69,0.38,0.5,null,0.06,0.53,0.1,0.69000000000000006,null,0.38,0.4,0.1,0.5,null,1.63,0.1,0.1,0.06,1.89,null,1,"Alap szántóföldi növények","Búza ","KAL01","Őszi búza"]
["KAL04","Őszi durumbúza","Igen","Igen","Igen",0.06,0.63,0.69,0.38,0.5,null,0.06,0.53,0.1,0.69000000000000006,null,0.38,0.4,0.1,0.5,null,1.63,0.1,0.1,0.06,1.89,null,1,"Alap szántóföldi növények","Búza ","KAL04","Őszi durumbúza"]
["KAL06","Őszi tönköly búza","Igen","Igen","Igen",0.06,0.63,0.69,0.38,0.5,null,0.06,0.53,0.1,0.69000000000000006,null,0.38,0.4,0.1,0.5,null,1.63,0.1,0.1,0.06,1.89,null,1,"Alap szántóföldi növények","Búza ","KAL06","Őszi tönköly búza"]
["KAL08","Őszi novum búza","Igen","Igen","Igen",0.06,0.63,0.69,0.38,0.5,null,0.06,0.53,0.1,0.69000000000000006,null,0.38,0.4,0.1,0.5,null,1.63,0.1,0.1,0.06,1.89,null,1,"Alap szántóföldi növények","Búza ","KAL08","Őszi novum búza"]
["KAL10","Őszi tönke búza","Igen","Igen","Igen",0.06,0.63,0.69,0.38,0.5,null,0.06,0.53,0.1,0.69000000000000006,null,0.38,0.4,0.1,0.5,null,1.63,0.1,0.1,0.06,1.89,null,1,"Alap szántóföldi növények","Búza ","KAL10","Őszi tönke búza"]
["KAL12","Őszi alakor búza","Igen","Igen","Igen",0.06,0.63,0.69,0.38,0.5,null,0.06,0.53,0.1,0.69000000000000006,null,0.38,0.4,0.1,0.5,null,1.63,0.1,0.1,0.06,1.89,null,1,"Alap szántóföldi növények","Búza ","KAL12","Őszi alakor búza"]
["KAL15","Rozs","Igen","Igen","Igen",0.06,0.63,0.69,0.38,0.5,null,0.06,0.53,0.1,0.69000000000000006,null,0.38,0.4,0.1,0.5,null,1.63,0.1,0.1,0.06,1.89,null,1,"Alap szántóföldi növények","Rozs ","KAL15","Rozs"]
{"$rows_left_out":293}
{"sheet":"Segéd","index":3,"n_rows":134,"n_cols":11,"rows_kept":134,"cut":false,"hidden":true,"merged":[]}
["Növény csoportok",null,"Alap_szántóföldi_növények",null,"Egyéb_növények",null,"Fűszernövények",null,"Gyümölcsösök_gyümölcsök",null,"Zöltségek"]
["Alap_szántóföldi_növények",null,"Oszlop1",null,"Oszlop1",null,"Oszlop1",null,"Oszlop1",null,"Oszlop1"]
["Egyéb_növények",null,"Kukorica",null,"Alexandriai here",null,"Abesszin (etiópiai) mustár",null,"Áfonya",null,"Articsóka"]
["Fűszernövények",null,"Napraforgó",null,"Angol perje",null,"Angyalgyökér",null,"Alma",null,"Batáta (édesburgonya)"]
["Gyümölcsösök_gyümölcsök",null,"Őszi alakor búza",null,"Bíborhere",null,"Ánizs",null,"Berkenye",null,"Bimbóskel"]
["Zöltségek",null,"Őszi árpa",null,"Burgonya",null,"Ánizsizsóp",null,"Birs",null,"Borsmustár (rukkola)"]
["Nincs",null,"Őszi búza",null,"Cérnatippan",null,"Ánizsmenta",null,"Csemegeszőlő ültetvény",null,"Brokkoli"]
[null,null,"Őszi durumbúza",null,"Cikória",null,"Anyarozs",null,"Cseresznye",null,"Cékla"]
[null,null,"Őszi káposztarepce",null,"Cukorborsó",null,"Bazsalikom",null,"Csipkebogyó",null,"Cukkini"]
[null,null,"Őszi novum búza",null,"Cukorcirok",null,"Bíbor kasvirág (Echinacea)",null,"Dió",null,"Csemegehagyma"]
[null,null,"Őszi tönke búza",null,"Cukorrépa",null,"Borágó",null,"Egyéb bodza",null,"Csillagtök/patiszon"]
[null,null,"Őszi tönköly búza",null,"Csemegekukorica",null,"Borsikafű",null,"Egyéb borszőlő szőlőültetvény",null,"Édeskömény"]
[null,null,"Őszi tritikálé",null,"Csenkeszperje",null,"Cickafark",null,"Egyéb ültetvény",null,"Egyéb zöldség"]
[null,null,"Rozs",null,"Csicseriborsó",null,"Citromfű",null,"Fehér eperfa",null,"Endívia"]
[null,null,"Tavaszi alakor búza",null,"Csicsóka",null,"Digitalis",null,"Fekete berkenye",null,"Fejes káposzta"]
[null,null,"Tavaszi árpa",null,"Csomós ebír",null,"Fűszerkömény",null,"Fekete bodza",null,"Fejessaláta"]
[null,null,"Tavaszi búza",null,"Dohány- Burley",null,"Gyermekláncfű",null,"Fekete eperfa",null,"Feketegyökér"]
[null,null,"Tavaszi durumbúza",null,"Dohány- Virginia",null,"Izsóp",null,"Földieper (szamóca)",null,"Főzőtök"]
[null,null,"Tavaszi káposztarepce",null,"Ebtippan",null,"Jázmin",null,"Füge",null,"Fűszerpaprika"]
[null,null,"Tavaszi novum búza",null,"Egyéb szántóföldi termelt növény",null,"Jázminpakóca (stevia)",null,"Görög dinnye",null,"Galambbegysaláta"]
{"$rows_left_out":114}